Reaction Details
TargetProto-oncogene tyrosine-protein kinase Src
LigandBDBM50354483
Substrate/Competitorn/a
Meas. Tech.ChEMBL_771562 (CHEMBL1837741)
Ki 7140±n/a nM
Citation Radi, MBrullo, CCrespan, ETintori, CMusumeci, FBiava, MSchenone, SDreassi, EZamperini, CMaga, GPagano, DAngelucci, ABologna, MBotta, M Identification of potent c-Src inhibitors strongly affecting the proliferation of human neuroblastoma cells. Bioorg Med Chem Lett21:5928-33 (2011) 
 
Proto-oncogene tyrosine-protein kinase Src
Name:Proto-oncogene tyrosine-protein kinase Src
Type:Protein
Mol. Mass.:59838.60
Organism:Homo sapiens (Human)
Description:P12931
Residue:536
BDBM50354483
NameBDBM50354483
Synonyms:CHEMBL1775034
TypeSmall organic molecule
Emp. Form.C20H18ClN5
Mol. Mass.363.843
SMILESCC(Cn1ncc2c(Nc3cccc(Cl)c3)ncnc12)c1ccccc1