Reaction Details
TargetProto-oncogene tyrosine-protein kinase Src
LigandBDBM50224366
Substrate/Competitorn/a
Meas. Tech.ChEMBL_771562 (CHEMBL1837741)
Ki 1710±n/a nM
Citation Radi, MBrullo, CCrespan, ETintori, CMusumeci, FBiava, MSchenone, SDreassi, EZamperini, CMaga, GPagano, DAngelucci, ABologna, MBotta, M Identification of potent c-Src inhibitors strongly affecting the proliferation of human neuroblastoma cells. Bioorg Med Chem Lett21:5928-33 (2011) 
 
Proto-oncogene tyrosine-protein kinase Src
Name:Proto-oncogene tyrosine-protein kinase Src
Type:Protein
Mol. Mass.:59838.60
Organism:Homo sapiens (Human)
Description:P12931
Residue:536
BDBM50224366
NameBDBM50224366
Synonyms:1-(2-chloro-2-phenylethyl)-N-(3-chlorophenyl)-1H-pyrazolo[3,4-d]pyrimidin-4-amine | CHEMBL238774
TypeSmall organic molecule
Emp. Form.C19H15Cl2N5
Mol. Mass.384.262
SMILESClC(Cn1ncc2c(Nc3cccc(Cl)c3)ncnc12)c1ccccc1