Reaction Details
TargetTyrosine-protein kinase ABL1
LigandBDBM50224377
Substrate/Competitorn/a
Meas. Tech.ChEMBL_771564 (CHEMBL1837743)
Ki 80±n/a nM
Citation Radi, MBrullo, CCrespan, ETintori, CMusumeci, FBiava, MSchenone, SDreassi, EZamperini, CMaga, GPagano, DAngelucci, ABologna, MBotta, M Identification of potent c-Src inhibitors strongly affecting the proliferation of human neuroblastoma cells. Bioorg Med Chem Lett21:5928-33 (2011) 
 
Tyrosine-protein kinase ABL1
Name:Tyrosine-protein kinase ABL1
Type:Enzyme
Mol. Mass.:122897.30
Organism:Homo sapiens (Human)
Description:P00519
Residue:1130
BDBM50224377
NameBDBM50224377
Synonyms:1-(2-chloro-2-phenylethyl)-N-(2-fluorobenzyl)-6-(methylthio)-1H-pyrazolo[3,4-d]pyrimidin-4-amine N-(2-fluorobenzyl)-1-(2-chloro-2-phenylethyl)-6-(methylthio)-1H-pyrazolo[3,4-d]pyrimidin-4-amine
TypeSmall organic molecule
Emp. Form.C21H19ClFN5S
Mol. Mass.427.925
SMILESCSc1nc(NCc2ccccc2F)c2cnn(CC(Cl)c3ccccc3)c2n1