Reaction Details
TargetTyrosine-protein kinase ABL1
LigandBDBM50224366
Substrate/Competitorn/a
Meas. Tech.ChEMBL_771564 (CHEMBL1837743)
Ki 240±n/a nM
Citation Radi, MBrullo, CCrespan, ETintori, CMusumeci, FBiava, MSchenone, SDreassi, EZamperini, CMaga, GPagano, DAngelucci, ABologna, MBotta, M Identification of potent c-Src inhibitors strongly affecting the proliferation of human neuroblastoma cells. Bioorg Med Chem Lett21:5928-33 (2011) 
 
Tyrosine-protein kinase ABL1
Name:Tyrosine-protein kinase ABL1
Type:Enzyme
Mol. Mass.:122897.30
Organism:Homo sapiens (Human)
Description:P00519
Residue:1130
BDBM50224366
NameBDBM50224366
Synonyms:1-(2-chloro-2-phenylethyl)-N-(3-chlorophenyl)-1H-pyrazolo[3,4-d]pyrimidin-4-amine | CHEMBL238774
TypeSmall organic molecule
Emp. Form.C19H15Cl2N5
Mol. Mass.384.262
SMILESClC(Cn1ncc2c(Nc3cccc(Cl)c3)ncnc12)c1ccccc1