Reaction Details
TargetTyrosine-protein kinase HCK
LigandBDBM50354480
Substrate/Competitorn/a
Meas. Tech.ChEMBL_771567 (CHEMBL1837746)
Ki 3870±n/a nM
Citation Radi, MBrullo, CCrespan, ETintori, CMusumeci, FBiava, MSchenone, SDreassi, EZamperini, CMaga, GPagano, DAngelucci, ABologna, MBotta, M Identification of potent c-Src inhibitors strongly affecting the proliferation of human neuroblastoma cells. Bioorg Med Chem Lett21:5928-33 (2011) 
 
Tyrosine-protein kinase HCK
Name:Tyrosine-protein kinase HCK
Type:Enzyme Catalytic Domain
Mol. Mass.:59600.18
Organism:Homo sapiens (Human)
Description:P08631
Residue:526
BDBM50354480
NameBDBM50354480
Synonyms:CHEMBL1836678
TypeSmall organic molecule
Emp. Form.C21H21N5S
Mol. Mass.375.49
SMILESCSc1nc(Nc2ccccc2)c2cnn(CC(C)c3ccccc3)c2n1