Reaction Details
TargetTyrosine-protein kinase HCK
LigandBDBM50354481
Substrate/Competitorn/a
Meas. Tech.ChEMBL_771567 (CHEMBL1837746)
Ki 5000±n/a nM
Citation Radi, MBrullo, CCrespan, ETintori, CMusumeci, FBiava, MSchenone, SDreassi, EZamperini, CMaga, GPagano, DAngelucci, ABologna, MBotta, M Identification of potent c-Src inhibitors strongly affecting the proliferation of human neuroblastoma cells. Bioorg Med Chem Lett21:5928-33 (2011) 
 
Tyrosine-protein kinase HCK
Name:Tyrosine-protein kinase HCK
Type:Enzyme Catalytic Domain
Mol. Mass.:59600.18
Organism:Homo sapiens (Human)
Description:P08631
Residue:526
BDBM50354481
NameBDBM50354481
Synonyms:CHEMBL1836679
TypeSmall organic molecule
Emp. Form.C21H20ClN5S
Mol. Mass.409.935
SMILESCSc1nc(Nc2cccc(Cl)c2)c2cnn(CC(C)c3ccccc3)c2n1