Reaction Details
TargetSerine/threonine-protein kinase pim-1
LigandBDBM50354476
Substrate/Competitorn/a
Meas. Tech.ChEMBL_771568 (CHEMBL1837747)
Ki 6500±n/a nM
Citation Radi, MBrullo, CCrespan, ETintori, CMusumeci, FBiava, MSchenone, SDreassi, EZamperini, CMaga, GPagano, DAngelucci, ABologna, MBotta, M Identification of potent c-Src inhibitors strongly affecting the proliferation of human neuroblastoma cells. Bioorg Med Chem Lett21:5928-33 (2011) 
 
Serine/threonine-protein kinase pim-1
Name:Serine/threonine-protein kinase pim-1
Type:Protein
Mol. Mass.:35681.82
Organism:Homo sapiens (Human)
Description:P11309
Residue:313
BDBM50354476
NameBDBM50354476
Synonyms:CHEMBL1836673
TypeSmall organic molecule
Emp. Form.C20H18ClN5S
Mol. Mass.395.908
SMILESCSc1nc(Nc2cccc(Cl)c2)c2cnn(CCc3ccccc3)c2n1