Reaction Details
TargetMitogen-activated protein kinase kinase kinase 8
LigandBDBM50354544
Substrate/Competitorn/a
Meas. Tech.ChEMBL_771668 (CHEMBL1838148)
IC50 1700±n/a nM
Citation Ni, YGopalsamy, ACole, DHu, YDenny, RIpek, MLiu, JLee, JHall, JPLuong, MTelliez, JBLin, LL Identification and SAR of a new series of thieno[3,2-d]pyrimidines as Tpl2 kinase inhibitors. Bioorg Med Chem Lett21:5952-6 (2011) 
 
Mitogen-activated protein kinase kinase kinase 8
Name:Mitogen-activated protein kinase kinase kinase 8
Type:Serine/threonine-protein kinase
Mol. Mass.:52916.89
Organism:Homo sapiens (Human)
Description:P41279
Residue:467
BDBM50354544
NameBDBM50354544
Synonyms:CHEMBL1836718
TypeSmall organic molecule
Emp. Form.C15H12N2O3S2
Mol. Mass.332.397
SMILESCOc1ccc(cc1)-c1cc2ncnc(SCC(O)=O)c2s1