Reaction Details
TargetCannabinoid receptor 1
LigandBDBM50140231
Substrate/Competitorn/a
Meas. Tech.ChEMBL_771755 (CHEMBL1838497)
Ki 56±n/a nM
Citation Fulp, ABortoff, KZhang, YSeltzman, HSnyder, RMaitra, R Towards rational design of cannabinoid receptor 1 (CB1) antagonists for peripheral selectivity. Bioorg Med Chem Lett21:5711-4 (2011) 
 
Cannabinoid receptor 1
Name:Cannabinoid receptor 1
Type:G Protein-Coupled Receptor (GPCR)
Mol. Mass.:52868.96
Organism:Homo sapiens (Human)
Description:P21554
Residue:472
BDBM50140231
NameBDBM50140231
Synonyms:5-(4-Chloro-phenyl)-1-(2,4-dichloro-phenyl)-4-methyl-1H-pyrazole-3-carboxylic acid pyridin-4-ylamide | CHEMBL428693
TypeSmall organic molecule
Emp. Form.C22H15Cl3N4O
Mol. Mass.457.74
SMILESCc1c(nn(c1-c1ccc(Cl)cc1)-c1ccc(Cl)cc1Cl)C(=O)Nc1ccncc1