Reaction Details
TargetCannabinoid receptor 1
LigandBDBM50354808
Substrate/Competitorn/a
Meas. Tech.ChEMBL_771755 (CHEMBL1838497)
Ki 49±n/a nM
Citation Fulp, ABortoff, KZhang, YSeltzman, HSnyder, RMaitra, R Towards rational design of cannabinoid receptor 1 (CB1) antagonists for peripheral selectivity. Bioorg Med Chem Lett21:5711-4 (2011) 
 
Cannabinoid receptor 1
Name:Cannabinoid receptor 1
Type:G Protein-Coupled Receptor (GPCR)
Mol. Mass.:52868.96
Organism:Homo sapiens (Human)
Description:P21554
Residue:472
BDBM50354808
NameBDBM50354808
Synonyms:CHEMBL1834014
TypeSmall organic molecule
Emp. Form.C24H28Cl3N5O3S
Mol. Mass.572.935
SMILESCc1c(nn(c1-c1ccc(Cl)cc1)-c1ccc(Cl)cc1Cl)C(=O)NCCCCCCCNS(N)(=O)=O