Reaction Details
TargetPotassium voltage-gated channel subfamily H member 2
LigandBDBM50354894
Substrate/Competitorn/a
Meas. Tech.ChEMBL_772749 (CHEMBL1837361)
IC50 17900±n/a nM
Citation Johnson, PSRyckmans, TBryans, JBeal, DMDack, KNFeeder, NHarrison, ALewis, MMason, HJMills, JNewman, JPasquinet, CRawson, DJRoberts, LRRussell, RSpark, DStobie, AUnderwood, TJWard, RWheeler, S Discovery of PF-184563, a potent and selective V1a antagonist for the treatment of dysmenorrhoea. The influence of compound flexibility on microsomal stability. Bioorg Med Chem Lett21:5684-7 (2011) 
 
Potassium voltage-gated channel subfamily H member 2
Name:Potassium voltage-gated channel subfamily H member 2
Type:Multi-pass membrane protein
Mol. Mass.:126672.65
Organism:Homo sapiens (Human)
Description:Q12809
Residue:1159
BDBM50354894
NameBDBM50354894
Synonyms:CHEMBL1837037
TypeSmall organic molecule
Emp. Form.C21H23ClN6
Mol. Mass.394.901
SMILESCN1Cc2nnc(C3CCN(CC3)c3ccccn3)n2-c2ccc(Cl)cc2C1