Reaction Details
TargetVasopressin V1a receptor
LigandBDBM50354902
Substrate/Competitorn/a
Meas. Tech.ChEMBL_772742 (CHEMBL1837354)
IC50 83±n/a nM
Citation Johnson, PSRyckmans, TBryans, JBeal, DMDack, KNFeeder, NHarrison, ALewis, MMason, HJMills, JNewman, JPasquinet, CRawson, DJRoberts, LRRussell, RSpark, DStobie, AUnderwood, TJWard, RWheeler, S Discovery of PF-184563, a potent and selective V1a antagonist for the treatment of dysmenorrhoea. The influence of compound flexibility on microsomal stability. Bioorg Med Chem Lett21:5684-7 (2011) 
 
Vasopressin V1a receptor
Name:Vasopressin V1a receptor
Type:Receptor
Mol. Mass.:46820.18
Organism:Homo sapiens (Human)
Description:P37288
Residue:418
BDBM50354902
NameBDBM50354902
Synonyms:CHEMBL1837019
TypeSmall organic molecule
Emp. Form.C21H25N5
Mol. Mass.347.4567
SMILESCc1nnc(C2CCN(CC2)c2ccccn2)n1Cc1cccc(C)c1