Reaction Details
TargetCystine/glutamate transporter
LigandBDBM82251
Substrate/Competitorn/a
Meas. Tech.ChEMBL_772170 (CHEMBL1838227)
IC50>1000000±n/a nM
Citation Shukla, KThomas, AGFerraris, DVHin, NSattler, RAlt, JRojas, CSlusher, BSTsukamoto, T Inhibition of xc¿?¿ transporter-mediated cystine uptake by sulfasalazine analogs. Bioorg Med Chem Lett21:6184-7 (2011) 
 
Cystine/glutamate transporter
Name:Cystine/glutamate transporter
Type:PROTEIN
Mol. Mass.:55437.48
Organism:Homo sapiens (Human)
Description:ChEMBL_772170
Residue:501
BDBM82251
NameBDBM82251
Synonyms:(R)-4-Carboxyphenylglycine CAS_134052-68-9
TypeSmall organic molecule
Emp. Form.C9H9NO4
Mol. Mass.195.1721
SMILESN[C@@H](C(O)=O)c1ccc(cc1)C(O)=O