Reaction Details
TargetCystine/glutamate transporter
LigandBDBM39340
Substrate/Competitorn/a
Meas. Tech.ChEMBL_772170 (CHEMBL1838227)
IC50>1000000±n/a nM
Citation Shukla, KThomas, AGFerraris, DVHin, NSattler, RAlt, JRojas, CSlusher, BSTsukamoto, T Inhibition of xc¿?¿ transporter-mediated cystine uptake by sulfasalazine analogs. Bioorg Med Chem Lett21:6184-7 (2011) 
 
Cystine/glutamate transporter
Name:Cystine/glutamate transporter
Type:PROTEIN
Mol. Mass.:55437.48
Organism:Homo sapiens (Human)
Description:ChEMBL_772170
Residue:501
BDBM39340
NameBDBM39340
Synonyms:4-Amino-N-(pyrimidin-2-yl) benzenesulfonamide (Sulfadiazine) (14) SMR000058213 cid_5336
TypeSmall organic molecule
Emp. Form.C11H11N3O2S
Mol. Mass.249.289
SMILESNc1ccc(cc1)S(=O)(=O)Nc1ccccn1