Reaction Details
TargetCystine/glutamate transporter
LigandBDBM60918
Substrate/Competitorn/a
Meas. Tech.ChEMBL_772170 (CHEMBL1838227)
IC50>1000000±n/a nM
Citation Shukla, KThomas, AGFerraris, DVHin, NSattler, RAlt, JRojas, CSlusher, BSTsukamoto, T Inhibition of xc¿?¿ transporter-mediated cystine uptake by sulfasalazine analogs. Bioorg Med Chem Lett21:6184-7 (2011) 
 
Cystine/glutamate transporter
Name:Cystine/glutamate transporter
Type:PROTEIN
Mol. Mass.:55437.48
Organism:Homo sapiens (Human)
Description:ChEMBL_772170
Residue:501
BDBM60918
NameBDBM60918
Synonyms:5-Amino-2-hydroxy-benzoic acid MLS001424012 cid_4075
TypeSmall organic molecule
Emp. Form.C7H7NO3
Mol. Mass.153.1354
SMILESNc1ccc(O)c(c1)C(O)=O