Reaction Details
TargetCystine/glutamate transporter
LigandBDBM50355002
Substrate/Competitorn/a
Meas. Tech.ChEMBL_772170 (CHEMBL1838227)
IC50 30000±n/a nM
Citation Shukla, KThomas, AGFerraris, DVHin, NSattler, RAlt, JRojas, CSlusher, BSTsukamoto, T Inhibition of xc¿?¿ transporter-mediated cystine uptake by sulfasalazine analogs. Bioorg Med Chem Lett21:6184-7 (2011) 
 
Cystine/glutamate transporter
Name:Cystine/glutamate transporter
Type:PROTEIN
Mol. Mass.:55437.48
Organism:Homo sapiens (Human)
Description:ChEMBL_772170
Residue:501
BDBM50355002
NameBDBM50355002
Synonyms:CHEMBL1834954
TypeSmall organic molecule
Emp. Form.C20H14N2O5S
Mol. Mass.394.401
SMILESOC(=O)c1cc(ccc1O)C#Cc1ccc(cc1)S(=O)(=O)Nc1ccccn1