Reaction Details
TargetKallikrein-5 [D153N]
LigandBDBM50355087
Substrate/Competitorn/a
Meas. Tech.ChEMBL_772791 (CHEMBL1837530)
Ki 47500±n/a nM
Citation Teixeira, TSFreitas, RFAbrahão, ODevienne, KFde Souza, LRBlaber, SIBlaber, MKondo, MYJuliano, MAJuliano, LPuzer, L Biological evaluation and docking studies of natural isocoumarins as inhibitors for human kallikrein 5 and 7. Bioorg Med Chem Lett21:6112-5 (2011) 
 
Kallikrein-5 [D153N]
Name:Kallikrein-5 [D153N]
Type:PROTEIN
Mol. Mass.:32031.75
Organism:Homo sapiens (Human)
Description:ChEMBL_1282456
Residue:293
BDBM50355087
NameBDBM50355087
Synonyms:CHEMBL1833982
TypeSmall organic molecule
Emp. Form.C16H14O6
Mol. Mass.302.2788
SMILESCOc1cc(O)c2c(O)c3c(cc(C)oc3=O)c(OC)c2c1