Reaction Details
TargetCaspase-3
LigandBDBM50355090
Substrate/Competitorn/a
Meas. Tech.ChEMBL_773170 (CHEMBL1838646)
IC50>25000±n/a nM
Citation Maillard, MCBrookfield, FACourtney, SMEustache, FMGemkow, MJHandel, RKJohnson, LCJohnson, PDKerry, MAKrieger, FMeniconi, MMuñoz-Sanjuán, IPalfrey, JJPark, HSchaertl, STaylor, MGWeddell, DDominguez, C Exploiting differences in caspase-2 and -3 S2 subsites for selectivity: structure-based design, solid-phase synthesis and in vitro activity of novel substrate-based caspase-2 inhibitors. Bioorg Med Chem19:5833-51 (2011) 
 
Caspase-3
Name:Caspase-3
Type:Hydrolase; heterotetramer of two heterodimers
Mol. Mass.:31607.55
Organism:Homo sapiens (Human)
Description:n/a
Residue:277
BDBM50355090
NameBDBM50355090
Synonyms:CHEMBL1835313
TypeSmall organic molecule
Emp. Form.C29H47N5O11
Mol. Mass.641.7104
SMILESCCC(C)O[C@H]1CCN([C@@H]1C(=O)N[C@H]1CC(=O)OC1O)C(=O)[C@@H](NC(=O)[C@H](CC(O)=O)NC(=O)[C@@H](NC(C)=O)C(C)C)C(C)C