Reaction Details
TargetCaspase-2
LigandBDBM50355112
Substrate/Competitorn/a
Meas. Tech.ChEMBL_773169 (CHEMBL1838645)
IC50 1940±n/a nM
Citation Maillard, MCBrookfield, FACourtney, SMEustache, FMGemkow, MJHandel, RKJohnson, LCJohnson, PDKerry, MAKrieger, FMeniconi, MMuñoz-Sanjuán, IPalfrey, JJPark, HSchaertl, STaylor, MGWeddell, DDominguez, C Exploiting differences in caspase-2 and -3 S2 subsites for selectivity: structure-based design, solid-phase synthesis and in vitro activity of novel substrate-based caspase-2 inhibitors. Bioorg Med Chem19:5833-51 (2011) 
 
Caspase-2
Name:Caspase-2
Type:Enzyme
Mol. Mass.:50688.29
Organism:Homo sapiens (Human)
Description:P42575
Residue:452
BDBM50355112
NameBDBM50355112
Synonyms:CHEMBL1835211
TypeSmall organic molecule
Emp. Form.C26H41N5O11
Mol. Mass.599.6306
SMILESCO[C@H]1CCN([C@@H]1C(=O)N[C@H]1CC(=O)OC1O)C(=O)[C@@H](NC(=O)[C@H](CC(O)=O)NC(=O)[C@@H](NC(C)=O)C(C)C)C(C)C