Reaction Details
TargetDiacylglycerol O-acyltransferase 1
LigandBDBM50355147
Substrate/Competitorn/a
Meas. Tech.ChEMBL_772696 (CHEMBL1837164)
IC50 175±n/a nM
Citation Dow, RLAndrews, MAspnes, GEBalan, GMichael Gibbs, EGuzman-Perez, AKarki, KLaperle, JLLi, JCLitchfield, JMunchhof, MJPerreault, CPatel, L Design and synthesis of potent, orally-active DGAT-1 inhibitors containing a dioxino[2,3-d]pyrimidine core. Bioorg Med Chem Lett21:6122-5 (2011) 
 
Diacylglycerol O-acyltransferase 1
Name:Diacylglycerol O-acyltransferase 1
Type:Protein
Mol. Mass.:55297.82
Organism:Homo sapiens (Human)
Description:O75907
Residue:488
BDBM50355147
NameBDBM50355147
Synonyms:CHEMBL1834556
TypeSmall organic molecule
Emp. Form.C20H22N4O2
Mol. Mass.350.4143
SMILESNc1ncnc2OC[C@@H](Oc12)c1ccc(cc1)[C@H]1CC[C@H](CC#N)CC1