Reaction Details
TargetMu-type opioid receptor
LigandBDBM50355375
Substrate/Competitorn/a
Meas. Tech.ChEMBL_773192 (CHEMBL1838668)
IC50 55±n/a nM
Citation Vardanyan, RKumirov, VKNichol, GSDavis, PLiktor-Busa, ERankin, DVarga, EVanderah, TPorreca, FLai, JHruby, VJ Synthesis and biological evaluation of new opioid agonist and neurokinin-1 antagonist bivalent ligands. Bioorg Med Chem19:6135-42 (2011) 
 
Mu-type opioid receptor
Name:Mu-type opioid receptor
Type:Enzyme Catalytic Domain
Mol. Mass.:11165.58
Organism:GUINEA PIG
Description:P97266
Residue:98
BDBM50355375
NameBDBM50355375
Synonyms:CHEMBL1835844
TypeSmall organic molecule
Emp. Form.C44H44F6N4O4
Mol. Mass.806.835
SMILESFC(F)(F)c1cc(COC(=O)[C@H](Cc2c[nH]c3ccccc23)NC(=O)CCCC(=O)N(C2CCN(CCc3ccccc3)CC2)c2ccccc2)cc(c1)C(F)(F)F