Reaction Details
TargetSubstance-P receptor
LigandBDBM50355375
Substrate/Competitorn/a
Meas. Tech.ChEMBL_773128 (CHEMBL1838098)
Ki 6.8±n/a nM
Citation Vardanyan, RKumirov, VKNichol, GSDavis, PLiktor-Busa, ERankin, DVarga, EVanderah, TPorreca, FLai, JHruby, VJ Synthesis and biological evaluation of new opioid agonist and neurokinin-1 antagonist bivalent ligands. Bioorg Med Chem19:6135-42 (2011) 
 
Substance-P receptor
Name:Substance-P receptor
Type:G Protein-Coupled Receptor (GPCR)
Mol. Mass.:46254.43
Organism:Homo sapiens (Human)
Description:P25103
Residue:407
BDBM50355375
NameBDBM50355375
Synonyms:CHEMBL1835844
TypeSmall organic molecule
Emp. Form.C44H44F6N4O4
Mol. Mass.806.835
SMILESFC(F)(F)c1cc(COC(=O)[C@H](Cc2c[nH]c3ccccc23)NC(=O)CCCC(=O)N(C2CCN(CCc3ccccc3)CC2)c2ccccc2)cc(c1)C(F)(F)F