Reaction Details
TargetEphrin type-B receptor 1
LigandBDBM50355393
Substrate/Competitorn/a
Meas. Tech.ChEMBL_773567 (CHEMBL1839933)
IC50 3039±n/a nM
Citation Guagnano, VFuret, PSpanka, CBordas, VLe Douget, MStamm, CBrueggen, JJensen, MRSchnell, CSchmid, HWartmann, MBerghausen, JDrueckes, PZimmerlin, ABussiere, DMurray, JGraus Porta, D Discovery of 3-(2,6-dichloro-3,5-dimethoxy-phenyl)-1-{6-[4-(4-ethyl-piperazin-1-yl)-phenylamino]-pyrimidin-4-yl}-1-methyl-urea (NVP-BGJ398), a potent and selective inhibitor of the fibroblast growth factor receptor family of receptor tyrosine kinase. J Med Chem54:7066-83 (2011) 
 
Ephrin type-B receptor 1
Name:Ephrin type-B receptor 1
Type:Enzyme Catalytic Domain
Mol. Mass.:109882.53
Organism:Homo sapiens (Human)
Description:EPH receptor B1 EPHB1 HUMAN::P54762
Residue:984
BDBM50355393
NameBDBM50355393
Synonyms:BGJ398 US9434697, BGJ398 | US9730931, BGJ398
TypeSmall organic molecule
Emp. Form.C26H31Cl2N7O3
Mol. Mass.560.475
SMILESCCN1CCN(CC1)c1ccc(Nc2cc(ncn2)N(C)C(=O)Nc2c(Cl)c(OC)cc(OC)c2Cl)cc1