Reaction Details
TargetCalcium/calmodulin-dependent protein kinase kinase 2
LigandBDBM25617
Substrate/Competitorn/a
Meas. Tech.ChEMBL_774540 (CHEMBL1908757)
Kd>10000±n/a nM
Citation Davis, MIHunt, JPHerrgard, SCiceri, PWodicka, LMPallares, GHocker, MTreiber, DKZarrinkar, PP Comprehensive analysis of kinase inhibitor selectivity. Nat Biotechnol29:1046-51 (2011) 
 
Calcium/calmodulin-dependent protein kinase kinase 2
Name:Calcium/calmodulin-dependent protein kinase kinase 2
Type:Enzyme Catalytic Domain
Mol. Mass.:64746.61
Organism:Homo sapiens (Human)
Description:gi_27437015
Residue:588
BDBM25617
NameBDBM25617
Synonyms:N-[3-({5-chloro-1H-pyrrolo[2,3-b]pyridin-3-yl}carbonyl)-2,4-difluorophenyl]propane-1-sulfonamide | PLX4720
TypeSmall organic molecule
Emp. Form.C17H14ClF2N3O3S
Mol. Mass.413.826
SMILESCCCS(=O)(=O)Nc1ccc(F)c(C(=O)c2c[nH]c3ncc(Cl)cc23)c1F