Reaction Details
TargeteIF-2-alpha kinase GCN2
LigandBDBM50326053
Substrate/Competitorn/a
Meas. Tech.ChEMBL_774290 (CHEMBL1908507)
Kd 39±n/a nM
Citation Davis, MIHunt, JPHerrgard, SCiceri, PWodicka, LMPallares, GHocker, MTreiber, DKZarrinkar, PP Comprehensive analysis of kinase inhibitor selectivity. Nat Biotechnol29:1046-51 (2011) 
 
eIF-2-alpha kinase GCN2
Name:eIF-2-alpha kinase GCN2
Type:PROTEIN
Mol. Mass.:186899.26
Organism:Homo sapiens (Human)
Description:ChEMBL_1495738
Residue:1649
BDBM50326053
NameBDBM50326053
Synonyms:CHEMBL608533 | PKC-412
TypeSmall organic molecule
Emp. Form.C35H30N4O4
Mol. Mass.570.6371
SMILESCO[C@@H]1[C@@H](C[C@H]2O[C@]1(C)n1c3ccccc3c3c4CNC(=O)c4c4c5ccccc5n2c4c13)N(C)C(=O)c1ccccc1