Reaction Details
TargetMAP/microtubule affinity-regulating kinase 3
LigandBDBM36409
Substrate/Competitorn/a
Meas. Tech.ChEMBL_774343 (CHEMBL1908560)
Kd>10000±n/a nM
Citation Davis, MIHunt, JPHerrgard, SCiceri, PWodicka, LMPallares, GHocker, MTreiber, DKZarrinkar, PP Comprehensive analysis of kinase inhibitor selectivity. Nat Biotechnol29:1046-51 (2011) 
 
MAP/microtubule affinity-regulating kinase 3
Name:MAP/microtubule affinity-regulating kinase 3
Type:Protein
Mol. Mass.:84525.94
Organism:Homo sapiens (Human)
Description:P27448
Residue:753
BDBM36409
NameBDBM36409
Synonyms:2-(4-amino-1-isopropyl-1H-pyrazolo[3,4-d]pyrimidin-3-yl)-1H-indol-5-ol, PP242 US10172858, Table 2.1 | US9828378, # 1
TypeSmall organic molecule
Emp. Form.C16H16N6O
Mol. Mass.308.3378
SMILESCC(C)n1nc(-c2cc3cc(O)ccc3[nH]2)c2c(N)ncnc12