Reaction Details
TargetSerine/threonine-protein kinase D2
LigandBDBM25084
Substrate/Competitorn/a
Meas. Tech.ChEMBL_774582 (CHEMBL1908799)
Kd>10000±n/a nM
Citation Davis, MIHunt, JPHerrgard, SCiceri, PWodicka, LMPallares, GHocker, MTreiber, DKZarrinkar, PP Comprehensive analysis of kinase inhibitor selectivity. Nat Biotechnol29:1046-51 (2011) 
 
Serine/threonine-protein kinase D2
Name:Serine/threonine-protein kinase D2
Type:Protein
Mol. Mass.:96755.22
Organism:Homo sapiens (Human)
Description:Q9BZL6
Residue:878
BDBM25084
NameBDBM25084
Synonyms:3-[2,4-diamino-6-(3-hydroxyphenyl)pteridin-7-yl]phenol TG100-115
TypeSmall organic molecule
Emp. Form.C18H14N6O2
Mol. Mass.346.3428
SMILESNc1nc(N)c2nc(-c3cccc(O)c3)c(nc2n1)-c1cccc(O)c1