Reaction Details
TargetSerine/threonine-protein kinase MAK
LigandBDBM50026612
Substrate/Competitorn/a
Meas. Tech.ChEMBL_774505 (CHEMBL1908722)
Kd>10000±n/a nM
Citation Davis, MIHunt, JPHerrgard, SCiceri, PWodicka, LMPallares, GHocker, MTreiber, DKZarrinkar, PP Comprehensive analysis of kinase inhibitor selectivity. Nat Biotechnol29:1046-51 (2011) 
 
Serine/threonine-protein kinase MAK
Name:Serine/threonine-protein kinase MAK
Type:PROTEIN
Mol. Mass.:70616.26
Organism:Homo sapiens (Human)
Description:ChEMBL_774505
Residue:623
BDBM50026612
NameBDBM50026612
Synonyms:BIBF-1120 US10981896, Compound Nintedanib US11208381, Nintedanib | Vargatef
TypeSmall organic molecule
Emp. Form.C31H33N5O4
Mol. Mass.539.6248
SMILESCOC(=O)c1ccc2\C(=C(\Nc3ccc(cc3)N(C)C(=O)CN3CCN(C)CC3)c3ccccc3)C(=O)Nc2c1