Reaction Details
TargetDeath-associated protein kinase 1
LigandBDBM25045
Substrate/Competitorn/a
Meas. Tech.ChEMBL_774451 (CHEMBL1908668)
Kd 2400±n/a nM
Citation Davis, MIHunt, JPHerrgard, SCiceri, PWodicka, LMPallares, GHocker, MTreiber, DKZarrinkar, PP Comprehensive analysis of kinase inhibitor selectivity. Nat Biotechnol29:1046-51 (2011) 
 
Death-associated protein kinase 1
Name:Death-associated protein kinase 1
Type:PROTEIN
Mol. Mass.:160053.35
Organism:Homo sapiens (Human)
Description:ChEMBL_1517177
Residue:1430
BDBM25045
NameBDBM25045
Synonyms:3-(4-morpholin-4-ylpyrido[2,3]furo[2,4-b]pyrimidin-2-yl)phenol 3-(4-morpholinopyrido[2,3]furo[2,4-b]pyrimidin-2-yl)phenol 3-[6-(morpholin-4-yl)-8-oxa-3,5,10-triazatricyclo[7.4.0.0^{2,7}]trideca-1(9),2,4,6,10,12-hexaen-4-yl]phenol PI-103 cid_9884685 pyridofuropyrimidine derivative, 2
TypeSmall organic molecule
Emp. Form.C19H16N4O3
Mol. Mass.348.3553
SMILESOc1cccc(c1)-c1nc(N2CCOCC2)c2oc3ncccc3c2n1