Reaction Details
TargetCalcium-dependent protein kinase 1
LigandBDBM50026612
Substrate/Competitorn/a
Meas. Tech.ChEMBL_774239 (CHEMBL1908456)
Kd 1200±n/a nM
Citation Davis, MIHunt, JPHerrgard, SCiceri, PWodicka, LMPallares, GHocker, MTreiber, DKZarrinkar, PP Comprehensive analysis of kinase inhibitor selectivity. Nat Biotechnol29:1046-51 (2011) 
 
Calcium-dependent protein kinase 1
Name:Calcium-dependent protein kinase 1
Type:PROTEIN
Mol. Mass.:60804.87
Organism:Plasmodium Falciparum
Description:P62343
Residue:524
BDBM50026612
NameBDBM50026612
Synonyms:BIBF-1120 US10981896, Compound Nintedanib US11208381, Nintedanib | Vargatef
TypeSmall organic molecule
Emp. Form.C31H33N5O4
Mol. Mass.539.6248
SMILESCOC(=O)c1ccc2\C(=C(\Nc3ccc(cc3)N(C)C(=O)CN3CCN(C)CC3)c3ccccc3)C(=O)Nc2c1