Reaction Details
TargetProto-oncogene tyrosine-protein kinase receptor Ret
LigandBDBM25084
Substrate/Competitorn/a
Meas. Tech.ChEMBL_774604 (CHEMBL1908821)
Kd>10000±n/a nM
Citation Davis, MIHunt, JPHerrgard, SCiceri, PWodicka, LMPallares, GHocker, MTreiber, DKZarrinkar, PP Comprehensive analysis of kinase inhibitor selectivity. Nat Biotechnol29:1046-51 (2011) 
 
Proto-oncogene tyrosine-protein kinase receptor Ret
Name:Proto-oncogene tyrosine-protein kinase receptor Ret
Type:Protein
Mol. Mass.:124318.29
Organism:Homo sapiens (Human)
Description:P07949
Residue:1114
BDBM25084
NameBDBM25084
Synonyms:3-[2,4-diamino-6-(3-hydroxyphenyl)pteridin-7-yl]phenol TG100-115
TypeSmall organic molecule
Emp. Form.C18H14N6O2
Mol. Mass.346.3428
SMILESNc1nc(N)c2nc(-c3cccc(O)c3)c(nc2n1)-c1cccc(O)c1