Reaction Details
TargetTyrosine-protein kinase ABL1
LigandBDBM25617
Substrate/Competitorn/a
Meas. Tech.ChEMBL_774466 (CHEMBL1908683)
Kd 200±n/a nM
Citation Davis, MIHunt, JPHerrgard, SCiceri, PWodicka, LMPallares, GHocker, MTreiber, DKZarrinkar, PP Comprehensive analysis of kinase inhibitor selectivity. Nat Biotechnol29:1046-51 (2011) 
 
Tyrosine-protein kinase ABL1
Name:Tyrosine-protein kinase ABL1
Type:Enzyme
Mol. Mass.:122897.30
Organism:Homo sapiens (Human)
Description:P00519
Residue:1130
BDBM25617
NameBDBM25617
Synonyms:N-[3-({5-chloro-1H-pyrrolo[2,3-b]pyridin-3-yl}carbonyl)-2,4-difluorophenyl]propane-1-sulfonamide | PLX4720
TypeSmall organic molecule
Emp. Form.C17H14ClF2N3O3S
Mol. Mass.413.826
SMILESCCCS(=O)(=O)Nc1ccc(F)c(C(=O)c2c[nH]c3ncc(Cl)cc23)c1F