Reaction Details
TargetTyrosine-protein kinase JAK1
LigandBDBM50193995
Substrate/Competitorn/a
Meas. Tech.ChEMBL_774338 (CHEMBL1908555)
Kd>10000±n/a nM
Citation Davis, MIHunt, JPHerrgard, SCiceri, PWodicka, LMPallares, GHocker, MTreiber, DKZarrinkar, PP Comprehensive analysis of kinase inhibitor selectivity. Nat Biotechnol29:1046-51 (2011) 
 
Tyrosine-protein kinase JAK1
Name:Tyrosine-protein kinase JAK1
Type:Protein
Mol. Mass.:133293.73
Organism:Homo sapiens (Human)
Description:P23458
Residue:1154
BDBM50193995
NameBDBM50193995
Synonyms:3-((3R,4R)-4-methyl-3-(methyl(7H-pyrrolo[2,3-d]pyrimidin-4-yl)amino)piperidin-1-yl)-3-oxopropanenitrile 3-{(3R,4R)-4-methyl-3-[methyl(7H-pyrrolo[2,3-d]pyrimidin-4-yl)amino]piperidin-1-yl}-3-oxopropanenitrile CP-690550 Tofacitinib US10112907, Example 00035 US10766894, Compound TABLE 1.20 US11078206, Example Tofacitinib US11339167, Example Tofacitinib
TypeSmall organic molecule
Emp. Form.C16H20N6O
Mol. Mass.312.3696
SMILESC[C@@H]1CCN(C[C@@H]1N(C)c1ncnc2[nH]ccc12)C(=O)CC#N