Reaction Details
TargetTyrosine-protein kinase ABL1
LigandBDBM50331096
Substrate/Competitorn/a
Meas. Tech.ChEMBL_774462 (CHEMBL1908679)
Kd 280±n/a nM
Citation Davis, MIHunt, JPHerrgard, SCiceri, PWodicka, LMPallares, GHocker, MTreiber, DKZarrinkar, PP Comprehensive analysis of kinase inhibitor selectivity. Nat Biotechnol29:1046-51 (2011) 
 
Tyrosine-protein kinase ABL1
Name:Tyrosine-protein kinase ABL1
Type:Enzyme
Mol. Mass.:122897.30
Organism:Homo sapiens (Human)
Description:P00519
Residue:1130
BDBM50331096
NameBDBM50331096
Synonyms:4-(4-fluoro-2-methyl-1H-indol-5-yloxy)-6-methoxy-7-(3-(pyrrolidin-1-yl)propoxy)quinazoline Cediranib ZD-2171
TypeSmall organic molecule
Emp. Form.C25H27FN4O3
Mol. Mass.450.5053
SMILESCOc1cc2c(Oc3ccc4[nH]c(C)cc4c3F)ncnc2cc1OCCCN1CCCC1