Reaction Details
TargetcGMP-dependent protein kinase 1
LigandBDBM15138
Substrate/Competitorn/a
Meas. Tech.ChEMBL_774532 (CHEMBL1908749)
Kd 270±n/a nM
Citation Davis, MIHunt, JPHerrgard, SCiceri, PWodicka, LMPallares, GHocker, MTreiber, DKZarrinkar, PP Comprehensive analysis of kinase inhibitor selectivity. Nat Biotechnol29:1046-51 (2011) 
 
cGMP-dependent protein kinase 1
Name:cGMP-dependent protein kinase 1
Type:Protein
Mol. Mass.:76358.04
Organism:Homo sapiens (Human)
Description:Q13976
Residue:671
BDBM15138
NameBDBM15138
Synonyms:5-indazolyl pyridine 11g A-674563 indazole-pyridine, 7
TypeSmall organic molecule
Emp. Form.C22H22N4O
Mol. Mass.358.4363
SMILESCc1n[nH]c2ccc(cc12)-c1cncc(OC[C@@H](N)Cc2ccccc2)c1