Reaction Details
TargetRho-associated protein kinase 2
LigandBDBM50355495
Substrate/Competitorn/a
Meas. Tech.ChEMBL_774449 (CHEMBL1908666)
Kd>10000±n/a nM
Citation Davis, MIHunt, JPHerrgard, SCiceri, PWodicka, LMPallares, GHocker, MTreiber, DKZarrinkar, PP Comprehensive analysis of kinase inhibitor selectivity. Nat Biotechnol29:1046-51 (2011) 
 
Rho-associated protein kinase 2
Name:Rho-associated protein kinase 2
Type:Protein
Mol. Mass.:160885.43
Organism:Homo sapiens (Human)
Description:O75116
Residue:1388
BDBM50355495
NameBDBM50355495
Synonyms:CHEMBL1908391
TypeSmall organic molecule
Emp. Form.C28H30N6OS
Mol. Mass.498.642
SMILESCN1CCN(Cc2ccc(cc2)C(=O)Nc2ccc(C)c(Nc3nc(cs3)-c3cccnc3)c2)CC1