Reaction Details
TargetEpidermal growth factor receptor
LigandBDBM36409
Substrate/Competitorn/a
Meas. Tech.ChEMBL_774480 (CHEMBL1908697)
Kd 970±n/a nM
Citation Davis, MIHunt, JPHerrgard, SCiceri, PWodicka, LMPallares, GHocker, MTreiber, DKZarrinkar, PP Comprehensive analysis of kinase inhibitor selectivity. Nat Biotechnol29:1046-51 (2011) 
 
Epidermal growth factor receptor
Name:Epidermal growth factor receptor
Type:Receptor Kinase Domain
Mol. Mass.:134279.59
Organism:Homo sapiens (Human)
Description:P00533
Residue:1210
BDBM36409
NameBDBM36409
Synonyms:2-(4-amino-1-isopropyl-1H-pyrazolo[3,4-d]pyrimidin-3-yl)-1H-indol-5-ol, PP242 US10172858, Table 2.1 | US9828378, # 1
TypeSmall organic molecule
Emp. Form.C16H16N6O
Mol. Mass.308.3378
SMILESCC(C)n1nc(-c2cc3cc(O)ccc3[nH]2)c2c(N)ncnc12