Reaction Details
TargetTyrosine-protein kinase ABL1
LigandBDBM50355495
Substrate/Competitorn/a
Meas. Tech.ChEMBL_774462 (CHEMBL1908679)
Kd 110±n/a nM
Citation Davis, MIHunt, JPHerrgard, SCiceri, PWodicka, LMPallares, GHocker, MTreiber, DKZarrinkar, PP Comprehensive analysis of kinase inhibitor selectivity. Nat Biotechnol29:1046-51 (2011) 
 
Tyrosine-protein kinase ABL1
Name:Tyrosine-protein kinase ABL1
Type:Enzyme
Mol. Mass.:122897.30
Organism:Homo sapiens (Human)
Description:P00519
Residue:1130
BDBM50355495
NameBDBM50355495
Synonyms:CHEMBL1908391
TypeSmall organic molecule
Emp. Form.C28H30N6OS
Mol. Mass.498.642
SMILESCN1CCN(Cc2ccc(cc2)C(=O)Nc2ccc(C)c(Nc3nc(cs3)-c3cccnc3)c2)CC1