Reaction Details
TargetMyosin-IIIb
LigandBDBM50355500
Substrate/Competitorn/a
Meas. Tech.ChEMBL_774297 (CHEMBL1908514)
Kd>10000±n/a nM
Citation Davis, MIHunt, JPHerrgard, SCiceri, PWodicka, LMPallares, GHocker, MTreiber, DKZarrinkar, PP Comprehensive analysis of kinase inhibitor selectivity. Nat Biotechnol29:1046-51 (2011) 
 
Myosin-IIIb
Name:Myosin-IIIb
Type:PROTEIN
Mol. Mass.:151861.71
Organism:Homo sapiens (Human)
Description:ChEMBL_774297
Residue:1341
BDBM50355500
NameBDBM50355500
Synonyms:CHEMBL1908394 | US9695172, GSK461364
TypeSmall organic molecule
Emp. Form.C27H28F3N5O2S
Mol. Mass.543.604
SMILESC[C@@H](Oc1cc(sc1C(N)=O)-n1cnc2ccc(CN3CCN(C)CC3)cc12)c1ccccc1C(F)(F)F