Reaction Details
TargetSerine/threonine-protein kinase D2
LigandBDBM25628
Substrate/Competitorn/a
Meas. Tech.ChEMBL_774582 (CHEMBL1908799)
Kd>10000±n/a nM
Citation Davis, MIHunt, JPHerrgard, SCiceri, PWodicka, LMPallares, GHocker, MTreiber, DKZarrinkar, PP Comprehensive analysis of kinase inhibitor selectivity. Nat Biotechnol29:1046-51 (2011) 
 
Serine/threonine-protein kinase D2
Name:Serine/threonine-protein kinase D2
Type:Protein
Mol. Mass.:96755.22
Organism:Homo sapiens (Human)
Description:Q9BZL6
Residue:878
BDBM25628
NameBDBM25628
Synonyms:2-{4-[(1Z)-1-(hydroxyimino)-2,3-dihydro-1H-inden-5-yl]-3-(pyridin-4-yl)-1H-pyrazol-1-yl}ethan-1-ol CHEMBL525191 | GDC-0879
TypeSmall organic molecule
Emp. Form.C19H18N4O2
Mol. Mass.334.3718
SMILESOCCn1cc(c(n1)-c1ccncc1)-c1ccc2C(CCc2c1)N=O