Reaction Details
TargetTyrosine-protein kinase ABL1
LigandBDBM50306682
Substrate/Competitorn/a
Meas. Tech.ChEMBL_774462 (CHEMBL1908679)
Kd 590±n/a nM
Citation Davis, MIHunt, JPHerrgard, SCiceri, PWodicka, LMPallares, GHocker, MTreiber, DKZarrinkar, PP Comprehensive analysis of kinase inhibitor selectivity. Nat Biotechnol29:1046-51 (2011) 
 
Tyrosine-protein kinase ABL1
Name:Tyrosine-protein kinase ABL1
Type:Enzyme
Mol. Mass.:122897.30
Organism:Homo sapiens (Human)
Description:P00519
Residue:1130
BDBM50306682
NameBDBM50306682
Synonyms:(R)-3-(1-(2,6-dichloro-3-fluorophenyl)ethoxy)-5-(1-(piperidin-4-yl)-1H-pyrazol-4-yl)pyridin-2-amine 3-[(1R)-1-(2,6-dichloro-3-fluorophenyl)ethoxy]-5-(1-piperidin-4-yl-1H-pyrazol-4-yl)pyridin-2-amine CRIZOTINIB US10370379, Crizotinib US10780082, Compound Crizotinib US11517561, Compound Crizotinib US9199944, Crizotinib | US9226923, Crizotinib
TypeSmall organic molecule
Emp. Form.C21H22Cl2FN5O
Mol. Mass.450.337
SMILESC[C@@H](Oc1cc(cnc1N)-c1cnn(c1)C1CCNCC1)c1c(Cl)ccc(F)c1Cl