Reaction Details
TargetRibosomal protein S6 kinase alpha-6
LigandBDBM482158
Substrate/Competitorn/a
Meas. Tech.ChEMBL_774561 (CHEMBL1908778)
Kd 27±n/a nM
Citation Davis, MIHunt, JPHerrgard, SCiceri, PWodicka, LMPallares, GHocker, MTreiber, DKZarrinkar, PP Comprehensive analysis of kinase inhibitor selectivity. Nat Biotechnol29:1046-51 (2011) 
 
Ribosomal protein S6 kinase alpha-6
Name:Ribosomal protein S6 kinase alpha-6
Type:Serine/threonine-protein kinase
Mol. Mass.:83868.06
Organism:Homo sapiens (Human)
Description:n/a
Residue:745
BDBM482158
NameBDBM482158
Synonyms:BDBM50242742 | TAE684
Typen/a
Emp. Form.C30H40ClN7O3S
Mol. Mass.614.202
SMILESCOc1cc(ccc1Nc1ncc(Cl)c(Nc2ccccc2S(=O)(=O)C(C)C)n1)N1CCC(CC1)N1CCN(C)CC1