Reaction Details
TargetcAMP-dependent protein kinase catalytic subunit alpha
LigandBDBM25117
Substrate/Competitorn/a
Meas. Tech.ChEMBL_774361 (CHEMBL1908578)
Kd>10000±n/a nM
Citation Davis, MIHunt, JPHerrgard, SCiceri, PWodicka, LMPallares, GHocker, MTreiber, DKZarrinkar, PP Comprehensive analysis of kinase inhibitor selectivity. Nat Biotechnol29:1046-51 (2011) 
 
cAMP-dependent protein kinase catalytic subunit alpha
Name:cAMP-dependent protein kinase catalytic subunit alpha
Type:Enzyme Catalytic Subunit
Mol. Mass.:40598.73
Organism:Homo sapiens (Human)
Description:n/a
Residue:351
BDBM25117
NameBDBM25117
Synonyms:AG-013736 N-methyl-2-({3-[(E)-2-(pyridin-2-yl)ethenyl]-1H-indazol-6-yl}sulfanyl)benzamide US9205078, Axitinib | US9617222, Compound A
TypeSmall organic molecule
Emp. Form.C22H18N4OS
Mol. Mass.386.47
SMILESCNC(=O)c1ccccc1Sc1ccc2c(\C=C\c3ccccn3)n[nH]c2c1