Reaction Details
TargetMitogen-activated protein kinase kinase kinase 19
LigandBDBM50332294
Substrate/Competitorn/a
Meas. Tech.ChEMBL_774616 (CHEMBL1908833)
Kd 19±n/a nM
Citation Davis, MIHunt, JPHerrgard, SCiceri, PWodicka, LMPallares, GHocker, MTreiber, DKZarrinkar, PP Comprehensive analysis of kinase inhibitor selectivity. Nat Biotechnol29:1046-51 (2011) 
 
Mitogen-activated protein kinase kinase kinase 19
Name:Mitogen-activated protein kinase kinase kinase 19
Type:PROTEIN
Mol. Mass.:150549.39
Organism:Homo sapiens (Human)
Description:ChEMBL_774616
Residue:1328
BDBM50332294
NameBDBM50332294
Synonyms:CHEMBL1287853 US10112907, Example 00018 US10766894, Compound TABLE 1.3 US11384069, Example T-5
TypeSmall organic molecule
Emp. Form.C27H36N6O3S
Mol. Mass.524.678
SMILESCc1cnc(Nc2ccc(OCCN3CCCC3)cc2)nc1Nc1cccc(c1)S(=O)(=O)NC(C)(C)C