Reaction Details
TargetProtein kinase C delta type
LigandBDBM24773
Substrate/Competitorn/a
Meas. Tech.ChEMBL_774528 (CHEMBL1908745)
Kd>10000±n/a nM
Citation Davis, MIHunt, JPHerrgard, SCiceri, PWodicka, LMPallares, GHocker, MTreiber, DKZarrinkar, PP Comprehensive analysis of kinase inhibitor selectivity. Nat Biotechnol29:1046-51 (2011) 
 
Protein kinase C delta type
Name:Protein kinase C delta type
Type:Enzyme
Mol. Mass.:77516.79
Organism:Homo sapiens (Human)
Description:The recombinant human PKC enzymes were produced using a baculovirus expression system in SF9 cells
Residue:676
BDBM24773
NameBDBM24773
Synonyms:AMG 706 Motesanib N-(3,3-dimethyl-1,2-dihydroindol-6-yl)-2-(pyridin-4-ylmethylamino)pyridine-3-carboxamide N-(3,3-dimethylindolin-6-yl)-2-(4-pyridylmethylamino)nicotinamide cid_11667893
TypeSmall organic molecule
Emp. Form.C22H23N5O
Mol. Mass.373.4509
SMILESCC1(C)CNc2cc(NC(=O)c3cccnc3NCc3ccncc3)ccc12