Reaction Details
TargetSerine/threonine-protein kinase DCLK1
LigandBDBM25028
Substrate/Competitorn/a
Meas. Tech.ChEMBL_774446 (CHEMBL1908663)
Kd>10000±n/a nM
Citation Davis, MIHunt, JPHerrgard, SCiceri, PWodicka, LMPallares, GHocker, MTreiber, DKZarrinkar, PP Comprehensive analysis of kinase inhibitor selectivity. Nat Biotechnol29:1046-51 (2011) 
 
Serine/threonine-protein kinase DCLK1
Name:Serine/threonine-protein kinase DCLK1
Type:PROTEIN
Mol. Mass.:82239.64
Organism:Homo sapiens (Human)
Description:ChEMBL_774446
Residue:740
BDBM25028
NameBDBM25028
Synonyms:4-[2-(1H-indazol-4-yl)-6-[(4-methanesulfonylpiperazin-1-yl)methyl]thieno[3,2-d]pyrimidin-4-yl]morpholine GDC0941 US10851091, Compound pictilisib
TypeSmall organic molecule
Emp. Form.C23H27N7O3S2
Mol. Mass.513.636
SMILESCS(=O)(=O)N1CCN(Cc2cc3nc(nc(N4CCOCC4)c3s2)-c2cccc3[nH]ncc23)CC1