Reaction Details
TargetMitogen-activated protein kinase kinase kinase kinase 3
LigandBDBM4552
Substrate/Competitorn/a
Meas. Tech.ChEMBL_774401 (CHEMBL1908618)
Kd 5.1±n/a nM
Citation Davis, MIHunt, JPHerrgard, SCiceri, PWodicka, LMPallares, GHocker, MTreiber, DKZarrinkar, PP Comprehensive analysis of kinase inhibitor selectivity. Nat Biotechnol29:1046-51 (2011) 
 
Mitogen-activated protein kinase kinase kinase kinase 3
Name:Mitogen-activated protein kinase kinase kinase kinase 3
Type:PROTEIN
Mol. Mass.:101331.91
Organism:Homo sapiens (Human)
Description:ChEMBL_586461
Residue:894
BDBM4552
NameBDBM4552
Synonyms:4-[(2,4-Dichloro-5-methoxyphenyl)amino]-6-methoxy-7-[3-(4-methyl-1-piperazinyl)propoxy]-3-quinolinecarbonitrile BOSUTINIB SKI-606
TypeSmall organic molecule
Emp. Form.C26H29Cl2N5O3
Mol. Mass.530.446
SMILESCOc1cc(Nc2c(cnc3cc(OCCCN4CCN(C)CC4)c(OC)cc23)C#N)c(Cl)cc1Cl