Reaction Details
TargetPhosphatidylinositol 4-kinase beta
LigandBDBM50355494
Substrate/Competitorn/a
Meas. Tech.ChEMBL_774360 (CHEMBL1908577)
Kd>10000±n/a nM
Citation Davis, MIHunt, JPHerrgard, SCiceri, PWodicka, LMPallares, GHocker, MTreiber, DKZarrinkar, PP Comprehensive analysis of kinase inhibitor selectivity. Nat Biotechnol29:1046-51 (2011) 
 
Phosphatidylinositol 4-kinase beta
Name:Phosphatidylinositol 4-kinase beta
Type:Protein
Mol. Mass.:91373.30
Organism:Homo sapiens (Human)
Description:n/a
Residue:816
BDBM50355494
NameBDBM50355494
Synonyms:CHEMBL1908396
TypeSmall organic molecule
Emp. Form.C24H24N4O5S
Mol. Mass.480.536
SMILESCOc1cc(Oc2ccnc3cc(OC)c(OC)cc23)ccc1NC(=O)NC(C)c1nccs1