Reaction Details
TargetRibosomal protein S6 kinase beta-1
LigandBDBM50355494
Substrate/Competitorn/a
Meas. Tech.ChEMBL_774386 (CHEMBL1908603)
Kd>10000±n/a nM
Citation Davis, MIHunt, JPHerrgard, SCiceri, PWodicka, LMPallares, GHocker, MTreiber, DKZarrinkar, PP Comprehensive analysis of kinase inhibitor selectivity. Nat Biotechnol29:1046-51 (2011) 
 
Ribosomal protein S6 kinase beta-1
Name:Ribosomal protein S6 kinase beta-1
Type:Enzyme
Mol. Mass.:59139.89
Organism:Homo sapiens (Human)
Description:His-tagged S6K1.
Residue:525
BDBM50355494
NameBDBM50355494
Synonyms:CHEMBL1908396
TypeSmall organic molecule
Emp. Form.C24H24N4O5S
Mol. Mass.480.536
SMILESCOc1cc(Oc2ccnc3cc(OC)c(OC)cc23)ccc1NC(=O)NC(C)c1nccs1