Reaction Details
TargetMuscle, skeletal receptor tyrosine-protein kinase
LigandBDBM6568
Substrate/Competitorn/a
Meas. Tech.ChEMBL_774502 (CHEMBL1908719)
Kd>10000±n/a nM
Citation Davis, MIHunt, JPHerrgard, SCiceri, PWodicka, LMPallares, GHocker, MTreiber, DKZarrinkar, PP Comprehensive analysis of kinase inhibitor selectivity. Nat Biotechnol29:1046-51 (2011) 
 
Muscle, skeletal receptor tyrosine-protein kinase
Name:Muscle, skeletal receptor tyrosine-protein kinase
Type:PROTEIN
Mol. Mass.:97062.85
Organism:Homo sapiens (Human)
Description:ChEMBL_1474077
Residue:869
BDBM6568
NameBDBM6568
Synonyms:6-(2,6-dichlorophenyl)-8-methyl-2-{[3-(methylsulfanyl)phenyl]amino}-7H,8H-pyrido[2,3-d]pyrimidin-7-one PD-173955 US11136333, Compound PD173955
TypeSmall organic molecule
Emp. Form.C21H16Cl2N4OS
Mol. Mass.443.349
SMILESCSc1cccc(Nc2ncc3cc(-c4c(Cl)cccc4Cl)c(=O)n(C)c3n2)c1